Reaction Details
TargetAurora kinase B
LigandBDBM50348623
Substrate/Competitorn/a
Meas. Tech.ChEMBL_755593 (CHEMBL1805333)
IC50 700±n/a nM
Citation Belanger, DBCurran, PJHruza, AVoigt, JMeng, ZMandal, AKSiddiqui, MABasso, ADGray, K Discovery of imidazo[1,2-a]pyrazine-based Aurora kinase inhibitors. Bioorg Med Chem Lett20:5170-4 (2010) 
 
Aurora kinase B
Name:Aurora kinase B
Type:Protein
Mol. Mass.:39327.72
Organism:Homo sapiens (Human)
Description:Q96GD4
Residue:344
BDBM50348623
NameBDBM50348623
Synonyms:CHEMBL1801101
TypeSmall organic molecule
Emp. Form.C16H17N7S
Mol. Mass.339.418
SMILESCC(C)c1cc(Nc2nccn3c(cnc23)-c2cnn(C)c2)sn1