Reaction Details
TargetVascular endothelial growth factor receptor 2
LigandBDBM50348621
Substrate/Competitorn/a
Meas. Tech.ChEMBL_755627 (CHEMBL1805367)
IC50 36±n/a nM
Citation Belanger, DBCurran, PJHruza, AVoigt, JMeng, ZMandal, AKSiddiqui, MABasso, ADGray, K Discovery of imidazo[1,2-a]pyrazine-based Aurora kinase inhibitors. Bioorg Med Chem Lett20:5170-4 (2010) 
 
Vascular endothelial growth factor receptor 2
Name:Vascular endothelial growth factor receptor 2
Type:Receptor Tyrosine Kinase
Mol. Mass.:151510.97
Organism:Homo sapiens (Human)
Description:P35968
Residue:1356
BDBM50348621
NameBDBM50348621
Synonyms:CHEMBL1270795
TypeSmall organic molecule
Emp. Form.C14H13N7S2
Mol. Mass.343.43
SMILESCSc1cn2c(cnc2c(Nc2cc(C)ns2)n1)-c1cn[nH]c1