Reaction Details
TargetAurora kinase A
LigandBDBM50348632
Substrate/Competitorn/a
Meas. Tech.ChEMBL_755594 (CHEMBL1805334)
IC50 81±n/a nM
Citation Belanger, DBCurran, PJHruza, AVoigt, JMeng, ZMandal, AKSiddiqui, MABasso, ADGray, K Discovery of imidazo[1,2-a]pyrazine-based Aurora kinase inhibitors. Bioorg Med Chem Lett20:5170-4 (2010) 
 
Aurora kinase A
Name:Aurora kinase A
Type:Serine/threonine-protein kinase
Mol. Mass.:45830.98
Organism:Homo sapiens (Human)
Description:O14965
Residue:403
BDBM50348632
NameBDBM50348632
Synonyms:CHEMBL1801110
TypeSmall organic molecule
Emp. Form.C19H19N7O3S
Mol. Mass.425.464
SMILESO=S(=O)(N1CCOCC1)c1ccc(Nc2nccn3c(cnc23)-c2cn[nH]c2)cc1