Reaction Details
TargetAurora kinase A
LigandBDBM50348635
Substrate/Competitorn/a
Meas. Tech.ChEMBL_755594 (CHEMBL1805334)
IC50 83±n/a nM
Citation Belanger, DBCurran, PJHruza, AVoigt, JMeng, ZMandal, AKSiddiqui, MABasso, ADGray, K Discovery of imidazo[1,2-a]pyrazine-based Aurora kinase inhibitors. Bioorg Med Chem Lett20:5170-4 (2010) 
 
Aurora kinase A
Name:Aurora kinase A
Type:Serine/threonine-protein kinase
Mol. Mass.:45830.98
Organism:Homo sapiens (Human)
Description:O14965
Residue:403
BDBM50348635
NameBDBM50348635
Synonyms:CHEMBL1801114
TypeSmall organic molecule
Emp. Form.C15H16N8S
Mol. Mass.340.406
SMILESCc1cc(Nc2nc(CCN)cn3c(cnc23)-c2cn[nH]c2)sn1