Reaction Details
TargetAurora kinase A
LigandBDBM50348641
Substrate/Competitorn/a
Meas. Tech.ChEMBL_755594 (CHEMBL1805334)
IC50 22±n/a nM
Citation Belanger, DBCurran, PJHruza, AVoigt, JMeng, ZMandal, AKSiddiqui, MABasso, ADGray, K Discovery of imidazo[1,2-a]pyrazine-based Aurora kinase inhibitors. Bioorg Med Chem Lett20:5170-4 (2010) 
 
Aurora kinase A
Name:Aurora kinase A
Type:Serine/threonine-protein kinase
Mol. Mass.:45830.98
Organism:Homo sapiens (Human)
Description:O14965
Residue:403
BDBM50348641
NameBDBM50348641
Synonyms:CHEMBL1801131
TypeSmall organic molecule
Emp. Form.C15H15N7S2
Mol. Mass.357.457
SMILESCCSc1cn2c(cnc2c(Nc2cc(C)ns2)n1)-c1cn[nH]c1