Reaction Details
TargetMatrix metalloproteinase-14
LigandBDBM50348649
Substrate/Competitorn/a
Meas. Tech.ChEMBL_754465 (CHEMBL1806090)
IC50 3.7±n/a nM
Citation Becker, DPBarta, TEBedell, LJBoehm, TLBond, BRCarroll, JCarron, CPDecrescenzo, GAEaston, AMFreskos, JNFunckes-Shippy, CLHeron, MHockerman, SHoward, CPKiefer, JRLi, MHMathis, KJMcDonald, JJMehta, PPMunie, GESunyer, TSwearingen, CAVillamil, CIWelsch, DWilliams, JMYu, YYao, J Orally active MMP-1 sparinga-tetrahydropyranyl anda-piperidinyl sulfone matrix metalloproteinase (MMP) inhibitors with efficacy in cancer, arthritis, and cardiovascular disease. J Med Chem53:6653-80 (2010) 
 
Matrix metalloproteinase-14
Name:Matrix metalloproteinase-14
Type:Protein
Mol. Mass.:65900.19
Organism:Homo sapiens (Human)
Description:P50281
Residue:582
BDBM50348649
NameBDBM50348649
Synonyms:CHEMBL1801393
TypeSmall organic molecule
Emp. Form.C25H24F3N3O6S
Mol. Mass.551.535
SMILESONC(=O)C1(CCN(Cc2cccnc2)CC1)S(=O)(=O)c1ccc(Oc2ccc(OC(F)(F)F)cc2)cc1