Reaction Details
TargetMatrix metalloproteinase-9
LigandBDBM50343077
Substrate/Competitorn/a
Meas. Tech.ChEMBL_754463 (CHEMBL1806088)
IC50 0.180000±n/a nM
Citation Becker, DPBarta, TEBedell, LJBoehm, TLBond, BRCarroll, JCarron, CPDecrescenzo, GAEaston, AMFreskos, JNFunckes-Shippy, CLHeron, MHockerman, SHoward, CPKiefer, JRLi, MHMathis, KJMcDonald, JJMehta, PPMunie, GESunyer, TSwearingen, CAVillamil, CIWelsch, DWilliams, JMYu, YYao, J Orally active MMP-1 sparinga-tetrahydropyranyl anda-piperidinyl sulfone matrix metalloproteinase (MMP) inhibitors with efficacy in cancer, arthritis, and cardiovascular disease. J Med Chem53:6653-80 (2010) 
 
Matrix metalloproteinase-9
Name:Matrix metalloproteinase-9
Type:Enzyme
Mol. Mass.:78452.28
Organism:Homo sapiens (Human)
Description:P14780
Residue:707
BDBM50343077
NameBDBM50343077
Synonyms:CHEMBL1771212 | N-hydroxy-1-(2-methoxyethyl)-4-(4-(4-(trifluoromethoxy)phenoxy)phenylsulfonyl)piperidine-4-carboxamide
TypeSmall organic molecule
Emp. Form.C22H25F3N2O7S
Mol. Mass.518.503
SMILESCOCCN1CCC(CC1)(C(=O)NO)S(=O)(=O)c1ccc(Oc2ccc(OC(F)(F)F)cc2)cc1