Reaction Details
TargetCollagenase 3
LigandBDBM50348651
Substrate/Competitorn/a
Meas. Tech.ChEMBL_754464 (CHEMBL1806089)
IC50 0.100000±n/a nM
Citation Becker, DPBarta, TEBedell, LJBoehm, TLBond, BRCarroll, JCarron, CPDecrescenzo, GAEaston, AMFreskos, JNFunckes-Shippy, CLHeron, MHockerman, SHoward, CPKiefer, JRLi, MHMathis, KJMcDonald, JJMehta, PPMunie, GESunyer, TSwearingen, CAVillamil, CIWelsch, DWilliams, JMYu, YYao, J Orally active MMP-1 sparinga-tetrahydropyranyl anda-piperidinyl sulfone matrix metalloproteinase (MMP) inhibitors with efficacy in cancer, arthritis, and cardiovascular disease. J Med Chem53:6653-80 (2010) 
 
Collagenase 3
Name:Collagenase 3
Type:Enzyme
Mol. Mass.:53808.06
Organism:Homo sapiens (Human)
Description:P45452
Residue:471
BDBM50348651
NameBDBM50348651
Synonyms:CHEMBL1801430
TypeSmall organic molecule
Emp. Form.C22H23F3N2O6S
Mol. Mass.500.488
SMILESONC(=O)C1(CCN(CC1)C1CC1)S(=O)(=O)c1ccc(Oc2ccc(OC(F)(F)F)cc2)cc1