Reaction Details
TargetCollagenase 3
LigandBDBM50348664
Substrate/Competitorn/a
Meas. Tech.ChEMBL_754464 (CHEMBL1806089)
IC50 0.100000±n/a nM
Citation Becker, DPBarta, TEBedell, LJBoehm, TLBond, BRCarroll, JCarron, CPDecrescenzo, GAEaston, AMFreskos, JNFunckes-Shippy, CLHeron, MHockerman, SHoward, CPKiefer, JRLi, MHMathis, KJMcDonald, JJMehta, PPMunie, GESunyer, TSwearingen, CAVillamil, CIWelsch, DWilliams, JMYu, YYao, J Orally active MMP-1 sparinga-tetrahydropyranyl anda-piperidinyl sulfone matrix metalloproteinase (MMP) inhibitors with efficacy in cancer, arthritis, and cardiovascular disease. J Med Chem53:6653-80 (2010) 
 
Collagenase 3
Name:Collagenase 3
Type:Enzyme
Mol. Mass.:53808.06
Organism:Homo sapiens (Human)
Description:P45452
Residue:471
BDBM50348664
NameBDBM50348664
Synonyms:CHEMBL1801417
TypeSmall organic molecule
Emp. Form.C24H30N2O6S
Mol. Mass.474.57
SMILESCC(C)Oc1ccc(Oc2ccc(cc2)S(=O)(=O)C2(CCN(CC2)C2CC2)C(=O)NO)cc1