Reaction Details
TargetCollagenase 3
LigandBDBM11870
Substrate/Competitorn/a
Meas. Tech.ChEMBL_754464 (CHEMBL1806089)
IC50 0.150000±n/a nM
Citation Becker, DPBarta, TEBedell, LJBoehm, TLBond, BRCarroll, JCarron, CPDecrescenzo, GAEaston, AMFreskos, JNFunckes-Shippy, CLHeron, MHockerman, SHoward, CPKiefer, JRLi, MHMathis, KJMcDonald, JJMehta, PPMunie, GESunyer, TSwearingen, CAVillamil, CIWelsch, DWilliams, JMYu, YYao, J Orally active MMP-1 sparinga-tetrahydropyranyl anda-piperidinyl sulfone matrix metalloproteinase (MMP) inhibitors with efficacy in cancer, arthritis, and cardiovascular disease. J Med Chem53:6653-80 (2010) 
 
Collagenase 3
Name:Collagenase 3
Type:Enzyme
Mol. Mass.:53808.06
Organism:Homo sapiens (Human)
Description:P45452
Residue:471
BDBM11870
NameBDBM11870
Synonyms:4-{[4-(4-Chlorophenoxy)phenyl]sulfonyl}-N-hydroxy tetrahydro-2H-pyran-4-carboxamide alpha-sulfone 21
TypeSmall organic molecule
Emp. Form.C18H18ClNO6S
Mol. Mass.411.857
SMILESONC(=O)C1(CCOCC1)S(=O)(=O)c1ccc(Oc2ccc(Cl)cc2)cc1