Reaction Details
TargetInterstitial collagenase
LigandBDBM11870
Substrate/Competitorn/a
Meas. Tech.ChEMBL_754458 (CHEMBL1806083)
IC50 435±n/a nM
Citation Becker, DPBarta, TEBedell, LJBoehm, TLBond, BRCarroll, JCarron, CPDecrescenzo, GAEaston, AMFreskos, JNFunckes-Shippy, CLHeron, MHockerman, SHoward, CPKiefer, JRLi, MHMathis, KJMcDonald, JJMehta, PPMunie, GESunyer, TSwearingen, CAVillamil, CIWelsch, DWilliams, JMYu, YYao, J Orally active MMP-1 sparinga-tetrahydropyranyl anda-piperidinyl sulfone matrix metalloproteinase (MMP) inhibitors with efficacy in cancer, arthritis, and cardiovascular disease. J Med Chem53:6653-80 (2010) 
 
Interstitial collagenase
Name:Interstitial collagenase
Type:Enzyme
Mol. Mass.:54010.26
Organism:Homo sapiens (Human)
Description: P03956
Residue:469
BDBM11870
NameBDBM11870
Synonyms:4-{[4-(4-Chlorophenoxy)phenyl]sulfonyl}-N-hydroxy tetrahydro-2H-pyran-4-carboxamide alpha-sulfone 21
TypeSmall organic molecule
Emp. Form.C18H18ClNO6S
Mol. Mass.411.857
SMILESONC(=O)C1(CCOCC1)S(=O)(=O)c1ccc(Oc2ccc(Cl)cc2)cc1