Reaction Details
TargetPeptide deformylase, mitochondrial
LigandBDBM50349085
Substrate/Competitorn/a
Meas. Tech.ChEMBL_759151 (CHEMBL1811208)
IC50 25000±n/a nM
Citation Antczak, CShum, DBassit, BFrattini, MGLi, Yde Stanchina, EScheinberg, DADjaballah, H Identification of benzofuran-4,5-diones as novel and selective non-hydroxamic acid, non-peptidomimetic based inhibitors of human peptide deformylase. Bioorg Med Chem Lett21:4528-32 (2011) 
 
Peptide deformylase, mitochondrial
Name:Peptide deformylase, mitochondrial
Type:PROTEIN
Mol. Mass.:27023.25
Organism:Homo sapiens (Human)
Description:ChEMBL_154318
Residue:243
BDBM50349085
NameBDBM50349085
Synonyms:CHEMBL1808000
TypeSmall organic molecule
Emp. Form.C18H12Cl2O7
Mol. Mass.411.19
SMILESCOc1cc(cc(OC)c1OC)C(=O)c1coc2c1C(=O)C(=O)C(Cl)=C2Cl