Reaction Details
TargetPeptide deformylase, mitochondrial
LigandBDBM50349089
Substrate/Competitorn/a
Meas. Tech.ChEMBL_759151 (CHEMBL1811208)
IC50 32000±n/a nM
Citation Antczak, CShum, DBassit, BFrattini, MGLi, Yde Stanchina, EScheinberg, DADjaballah, H Identification of benzofuran-4,5-diones as novel and selective non-hydroxamic acid, non-peptidomimetic based inhibitors of human peptide deformylase. Bioorg Med Chem Lett21:4528-32 (2011) 
 
Peptide deformylase, mitochondrial
Name:Peptide deformylase, mitochondrial
Type:PROTEIN
Mol. Mass.:27023.25
Organism:Homo sapiens (Human)
Description:ChEMBL_154318
Residue:243
BDBM50349089
NameBDBM50349089
Synonyms:CHEMBL1807946
TypeSmall organic molecule
Emp. Form.C16H9BrO5
Mol. Mass.361.144
SMILESCOc1ccc(cc1)C(=O)c1coc2C=C(Br)C(=O)C(=O)c12