Reaction Details
TargetPeptide deformylase
LigandBDBM50349077
Substrate/Competitorn/a
Meas. Tech.ChEMBL_759152 (CHEMBL1811209)
IC50>100000±n/a nM
Citation Antczak, CShum, DBassit, BFrattini, MGLi, Yde Stanchina, EScheinberg, DADjaballah, H Identification of benzofuran-4,5-diones as novel and selective non-hydroxamic acid, non-peptidomimetic based inhibitors of human peptide deformylase. Bioorg Med Chem Lett21:4528-32 (2011) 
 
Peptide deformylase
Name:Peptide deformylase
Type:n/a
Mol. Mass.:16901.39
Organism:Escherichia coli
Description:n/a
Residue:150
BDBM50349077
NameBDBM50349077
Synonyms:CHEMBL1807949
TypeSmall organic molecule
Emp. Form.C15H6Cl2O4
Mol. Mass.321.112
SMILESClC1=C(Cl)C(=O)C(=O)c2c(coc12)C(=O)c1ccccc1