Reaction Details
TargetCarbonic anhydrase 1
LigandBDBM50349114
Substrate/Competitorn/a
Meas. Tech.ChEMBL_757844 (CHEMBL1809788)
Ki>50000±n/a nM
Citation Rodríguez, OMMaresca, ATémpera, CABravo, RDColinas, PASupuran, CT N-ß-glycosyl sulfamides are selective inhibitors of the cancer associated carbonic anhydrase isoforms IX and XII. Bioorg Med Chem Lett21:4447-50 (2011) 
 
Carbonic anhydrase 1
Name:Carbonic anhydrase 1
Type:Enzyme
Mol. Mass.:28873.37
Organism:Homo sapiens (Human)
Description:P00915
Residue:261
BDBM50349114
NameBDBM50349114
Synonyms:CHEMBL1807503
TypeSmall organic molecule
Emp. Form.C6H14N2O6S
Mol. Mass.242.25
SMILESC[C@H]1O[C@@H](NS(N)(=O)=O)[C@@H](O)[C@@H](O)[C@@H]1O