Reaction Details
TargetCarbonic anhydrase 9
LigandBDBM50349110
Substrate/Competitorn/a
Meas. Tech.ChEMBL_757846 (CHEMBL1809790)
Ki 5±n/a nM
Citation Rodríguez, OMMaresca, ATémpera, CABravo, RDColinas, PASupuran, CT N-ß-glycosyl sulfamides are selective inhibitors of the cancer associated carbonic anhydrase isoforms IX and XII. Bioorg Med Chem Lett21:4447-50 (2011) 
 
Carbonic anhydrase 9
Name:Carbonic anhydrase 9
Type:Enzyme
Mol. Mass.:49669.03
Organism:Homo sapiens (Human)
Description:Catalytic domain of human cloned isozyme was used in the assay
Residue:459
BDBM50349110
NameBDBM50349110
Synonyms:CHEMBL1807498
TypeSmall organic molecule
Emp. Form.C14H22N2O11S
Mol. Mass.426.396
SMILESCC(=O)OC[C@H]1O[C@@H](NS(N)(=O)=O)[C@@H](OC(C)=O)[C@@H](OC(C)=O)[C@@H]1OC(C)=O