Reaction Details
TargetCarbonic anhydrase 9
LigandBDBM50349113
Substrate/Competitorn/a
Meas. Tech.ChEMBL_757846 (CHEMBL1809790)
Ki 1790±n/a nM
Citation Rodríguez, OMMaresca, ATémpera, CABravo, RDColinas, PASupuran, CT N-ß-glycosyl sulfamides are selective inhibitors of the cancer associated carbonic anhydrase isoforms IX and XII. Bioorg Med Chem Lett21:4447-50 (2011) 
 
Carbonic anhydrase 9
Name:Carbonic anhydrase 9
Type:Enzyme
Mol. Mass.:49669.03
Organism:Homo sapiens (Human)
Description:Catalytic domain of human cloned isozyme was used in the assay
Residue:459
BDBM50349113
NameBDBM50349113
Synonyms:CHEMBL1807502
TypeSmall organic molecule
Emp. Form.C6H14N2O7S
Mol. Mass.258.25
SMILESNS(=O)(=O)N[C@@H]1O[C@H](CO)[C@@H](O)[C@H](O)[C@@H]1O