Reaction Details
TargetCarbonic anhydrase 12
LigandBDBM50349116
Substrate/Competitorn/a
Meas. Tech.ChEMBL_757847 (CHEMBL1809791)
Ki 7.8±n/a nM
Citation Rodríguez, OMMaresca, ATémpera, CABravo, RDColinas, PASupuran, CT N-ß-glycosyl sulfamides are selective inhibitors of the cancer associated carbonic anhydrase isoforms IX and XII. Bioorg Med Chem Lett21:4447-50 (2011) 
 
Carbonic anhydrase 12
Name:Carbonic anhydrase 12
Type:Enzyme
Mol. Mass.:39456.00
Organism:Homo sapiens (Human)
Description:Catalytic domain of human cloned isozyme was used in the assay
Residue:354
BDBM50349116
NameBDBM50349116
Synonyms:CHEMBL1807505
TypeSmall organic molecule
Emp. Form.C12H20N2O9S
Mol. Mass.368.36
SMILESCC(=O)OC[C@H]1O[C@H](C[C@@H](OC(C)=O)[C@H]1OC(C)=O)NS(N)(=O)=O