Reaction Details
TargetCarbonic anhydrase 1
LigandBDBM10887
Substrate/Competitorn/a
Meas. Tech.ChEMBL_757844 (CHEMBL1809788)
Ki 250±n/a nM
Citation Rodríguez, OMMaresca, ATémpera, CABravo, RDColinas, PASupuran, CT N-ß-glycosyl sulfamides are selective inhibitors of the cancer associated carbonic anhydrase isoforms IX and XII. Bioorg Med Chem Lett21:4447-50 (2011) 
 
Carbonic anhydrase 1
Name:Carbonic anhydrase 1
Type:Enzyme
Mol. Mass.:28873.37
Organism:Homo sapiens (Human)
Description:P00915
Residue:261
BDBM10887
NameBDBM10887
Synonyms:Sulfamate 7 US11535599, Example topiramate | [(1R,2S,6S,9R)-4,4,11,11-tetramethyl-3,5,7,10,12-pentaoxatricyclo[7.3.0.0^{2,6}]dodecan-6-yl]methyl sulfamate
TypeSmall organic molecule
Emp. Form.C12H21NO8S
Mol. Mass.339.362
SMILESCC1(C)O[C@@H]2CO[C@@]3(COS(N)(=O)=O)OC(C)(C)O[C@H]3[C@@H]2O1