Reaction Details
TargetCannabinoid receptor 2
LigandBDBM50349311
Substrate/Competitorn/a
Meas. Tech.ChEMBL_759948 (CHEMBL1810142)
Ki 27±n/a nM
Citation Evens, NVandeputte, CMuccioli, GGLambert, DMBaekelandt, VVerbruggen, AMDebyser, ZVan Laere, KBormans, GM Synthesis, in vitro and in vivo evaluation of fluorine-18 labelled FE-GW405833 as a PET tracer for type 2 cannabinoid receptor imaging. Bioorg Med Chem19:4499-505 (2011) 
 
Cannabinoid receptor 2
Name:Cannabinoid receptor 2
Type:G Protein-Coupled Receptor (GPCR)
Mol. Mass.:39690.94
Organism:Homo sapiens (Human)
Description:P34972
Residue:360
BDBM50349311
NameBDBM50349311
Synonyms:CHEMBL1807841
TypeSmall organic molecule
Emp. Form.C24H25Cl2FN2O3
Mol. Mass.479.371
SMILESCc1c(CCN2CCOCC2)c2cc(OCCF)ccc2n1C(=O)c1cccc(Cl)c1Cl