Reaction Details
Target3-oxoacyl-[acyl-carrier-protein] synthase 3
LigandBDBM50349536
Substrate/Competitorn/a
Meas. Tech.ChEMBL_759879 (CHEMBL1810025)
Ki 0.00019197±n/a nM
Citation Li, ZLLi, QSZhang, HJHu, YZhu, DDZhu, HL Design, synthesis and biological evaluation of urea derivatives from o-hydroxybenzylamines and phenylisocyanate as potential FabH inhibitors. Bioorg Med Chem19:4413-20 (2011) 
 
3-oxoacyl-[acyl-carrier-protein] synthase 3
Name:3-oxoacyl-[acyl-carrier-protein] synthase 3
Type:Enzyme
Mol. Mass.:33506.68
Organism:Escherichia coli
Description:C3TDZ2
Residue:317
BDBM50349536
NameBDBM50349536
Synonyms:CHEMBL1808861
TypeSmall organic molecule
Emp. Form.C21H18Br2N2O3
Mol. Mass.506.187
SMILESCOc1ccc(cc1)N(Cc1cc(Br)cc(Br)c1O)C(=O)Nc1ccccc1