Reaction Details
Target3-oxoacyl-[acyl-carrier-protein] synthase 3
LigandBDBM50349525
Substrate/Competitorn/a
Meas. Tech.ChEMBL_759879 (CHEMBL1810025)
IC50 56400±n/a nM
Citation Li, ZLLi, QSZhang, HJHu, YZhu, DDZhu, HL Design, synthesis and biological evaluation of urea derivatives from o-hydroxybenzylamines and phenylisocyanate as potential FabH inhibitors. Bioorg Med Chem19:4413-20 (2011) 
 
3-oxoacyl-[acyl-carrier-protein] synthase 3
Name:3-oxoacyl-[acyl-carrier-protein] synthase 3
Type:Enzyme
Mol. Mass.:33506.68
Organism:Escherichia coli
Description:C3TDZ2
Residue:317
BDBM50349525
NameBDBM50349525
Synonyms:CHEMBL1808850
TypeSmall organic molecule
Emp. Form.C20H16Br2N2O2
Mol. Mass.476.161
SMILESOc1ccc(Br)cc1CN(C(=O)Nc1ccccc1)c1ccccc1Br