Reaction Details
TargetMetabotropic glutamate receptor 5
LigandBDBM50349538
Substrate/Competitorn/a
Meas. Tech.ChEMBL_759909 (CHEMBL1810055)
Ki 360±n/a nM
Citation Weiss, JMJimenez, HNLi, GApril, MUberti, MABacolod, MDBrodbeck, RMDoller, D 6-Aryl-3-pyrrolidinylpyridines as mGlu5 receptor negative allosteric modulators. Bioorg Med Chem Lett21:4891-9 (2011) 
 
Metabotropic glutamate receptor 5
Name:Metabotropic glutamate receptor 5
Type:Enzyme
Mol. Mass.:132484.72
Organism:Homo sapiens (Human)
Description:n/a
Residue:1212
BDBM50349538
NameBDBM50349538
Synonyms:CHEMBL1808871
TypeSmall organic molecule
Emp. Form.C20H21ClN2O
Mol. Mass.340.847
SMILESClc1cccc(c1)-c1ccc(cn1)C1CCCN1C(=O)C1CCC1