Reaction Details
TargetMetabotropic glutamate receptor 5
LigandBDBM50349544
Substrate/Competitorn/a
Meas. Tech.ChEMBL_759908 (CHEMBL1810054)
IC50 120±n/a nM
Citation Weiss, JMJimenez, HNLi, GApril, MUberti, MABacolod, MDBrodbeck, RMDoller, D 6-Aryl-3-pyrrolidinylpyridines as mGlu5 receptor negative allosteric modulators. Bioorg Med Chem Lett21:4891-9 (2011) 
 
Metabotropic glutamate receptor 5
Name:Metabotropic glutamate receptor 5
Type:Enzyme
Mol. Mass.:132484.72
Organism:Homo sapiens (Human)
Description:n/a
Residue:1212
BDBM50349544
NameBDBM50349544
Synonyms:CHEMBL1806522
TypeSmall organic molecule
Emp. Form.C21H18ClFN4O
Mol. Mass.396.845
SMILESCc1cc(ncc1C1CC(F)CN1C(=O)c1cnccn1)-c1cccc(Cl)c1