Reaction Details
TargetMetabotropic glutamate receptor 5
LigandBDBM50349570
Substrate/Competitorn/a
Meas. Tech.ChEMBL_759908 (CHEMBL1810054)
IC50 3±n/a nM
Citation Weiss, JMJimenez, HNLi, GApril, MUberti, MABacolod, MDBrodbeck, RMDoller, D 6-Aryl-3-pyrrolidinylpyridines as mGlu5 receptor negative allosteric modulators. Bioorg Med Chem Lett21:4891-9 (2011) 
 
Metabotropic glutamate receptor 5
Name:Metabotropic glutamate receptor 5
Type:Enzyme
Mol. Mass.:132484.72
Organism:Homo sapiens (Human)
Description:n/a
Residue:1212
BDBM50349570
NameBDBM50349570
Synonyms:CHEMBL1808874
TypeSmall organic molecule
Emp. Form.C21H20ClN3O2
Mol. Mass.381.855
SMILESCc1cc(no1)C(=O)N1CCCC1c1cnc(cc1C)-c1cccc(Cl)c1