Reaction Details
TargetMetabotropic glutamate receptor 5
LigandBDBM50349541
Substrate/Competitorn/a
Meas. Tech.ChEMBL_759908 (CHEMBL1810054)
IC50 9±n/a nM
Citation Weiss, JMJimenez, HNLi, GApril, MUberti, MABacolod, MDBrodbeck, RMDoller, D 6-Aryl-3-pyrrolidinylpyridines as mGlu5 receptor negative allosteric modulators. Bioorg Med Chem Lett21:4891-9 (2011) 
 
Metabotropic glutamate receptor 5
Name:Metabotropic glutamate receptor 5
Type:Enzyme
Mol. Mass.:132484.72
Organism:Homo sapiens (Human)
Description:n/a
Residue:1212
BDBM50349541
NameBDBM50349541
Synonyms:CHEMBL1808868
TypeSmall organic molecule
Emp. Form.C19H16ClN3OS
Mol. Mass.369.868
SMILESClc1cccc(c1)-c1ccc(cn1)C1CCCN1C(=O)c1cncs1