Reaction Details
TargetMetabotropic glutamate receptor 5
LigandBDBM50349561
Substrate/Competitorn/a
Meas. Tech.ChEMBL_759909 (CHEMBL1810055)
Ki 16000±n/a nM
Citation Weiss, JMJimenez, HNLi, GApril, MUberti, MABacolod, MDBrodbeck, RMDoller, D 6-Aryl-3-pyrrolidinylpyridines as mGlu5 receptor negative allosteric modulators. Bioorg Med Chem Lett21:4891-9 (2011) 
 
Metabotropic glutamate receptor 5
Name:Metabotropic glutamate receptor 5
Type:Enzyme
Mol. Mass.:132484.72
Organism:Homo sapiens (Human)
Description:n/a
Residue:1212
BDBM50349561
NameBDBM50349561
Synonyms:CHEMBL1808883
TypeSmall organic molecule
Emp. Form.C22H24ClN3O2
Mol. Mass.397.898
SMILESCN1CC(CC1=O)C(=O)N1CCCC1c1cnc(cc1C)-c1cccc(Cl)c1