Reaction Details
TargetMetabotropic glutamate receptor 5
LigandBDBM50349543
Substrate/Competitorn/a
Meas. Tech.ChEMBL_759909 (CHEMBL1810055)
Ki 12±n/a nM
Citation Weiss, JMJimenez, HNLi, GApril, MUberti, MABacolod, MDBrodbeck, RMDoller, D 6-Aryl-3-pyrrolidinylpyridines as mGlu5 receptor negative allosteric modulators. Bioorg Med Chem Lett21:4891-9 (2011) 
 
Metabotropic glutamate receptor 5
Name:Metabotropic glutamate receptor 5
Type:Enzyme
Mol. Mass.:132484.72
Organism:Homo sapiens (Human)
Description:n/a
Residue:1212
BDBM50349543
NameBDBM50349543
Synonyms:CHEMBL1808901
TypeSmall organic molecule
Emp. Form.C20H18ClN3OS
Mol. Mass.383.894
SMILESCc1cc(ncc1[C@H]1CCCN1C(=O)c1nccs1)-c1cccc(Cl)c1