Reaction Details
TargetProthrombin
LigandBDBM50349609
Substrate/Competitorn/a
Meas. Tech.ChEMBL_759927 (CHEMBL1810121)
Ki 660±n/a nM
Citation Ilic, MKontogiorgis, CHadjipavlou-Litina, DIlaš, JKikelj, D Thrombin inhibitors with lipid peroxidation and lipoxygenase inhibitory activities. Bioorg Med Chem Lett21:4705-9 (2011) 
 
Prothrombin
Name:Prothrombin
Type:Protein
Mol. Mass.:70029.57
Organism:Homo sapiens (Human)
Description:P00734
Residue:622
BDBM50349609
NameBDBM50349609
Synonyms:CHEMBL1808949
TypeSmall organic molecule
Emp. Form.C29H32F2N4O4
Mol. Mass.538.5856
SMILESCCOC(=O)CN(Cc1ccc(F)c(F)c1)c1ccc2OC(C)(COc3ccc(cc3)C(N)=N)CN(C)c2c1