Reaction Details
TargetPhosphatidylinositol 4,5-bisphosphate 3-kinase catalytic subunit alpha isoform
LigandBDBM50349621
Substrate/Competitorn/a
Meas. Tech.ChEMBL_759993 (CHEMBL1810228)
IC50 0.4±n/a nM
Citation Dehnhardt, CMVenkatesan, AMChen, ZDelos-Santos, EAyral-Kaloustian, SBrooijmans, NYu, KHollander, IFeldberg, LLucas, JMallon, R Identification of 2-oxatriazines as highly potent pan-PI3K/mTOR dual inhibitors. Bioorg Med Chem Lett21:4773-8 (2011) 
 
Phosphatidylinositol 4,5-bisphosphate 3-kinase catalytic subunit alpha isoform
Name:Phosphatidylinositol 4,5-bisphosphate 3-kinase catalytic subunit alpha isoform
Type:Enzyme Subunit
Mol. Mass.:124294.87
Organism:Homo sapiens (Human)
Description:P42336
Residue:1068
BDBM50349621
NameBDBM50349621
Synonyms:CHEMBL1808979
TypeSmall organic molecule
Emp. Form.C27H34N8O4
Mol. Mass.534.6101
SMILESCOc1nc(nc(n1)-c1ccc(NC(=O)Nc2ccc(cc2)C(=O)N(C)CCN(C)C)cc1)N1CCOCC1