Reaction Details
TargetSerine/threonine-protein kinase mTOR
LigandBDBM50349619
Substrate/Competitorn/a
Meas. Tech.ChEMBL_760021 (CHEMBL1810297)
IC50 0.7±n/a nM
Citation Dehnhardt, CMVenkatesan, AMChen, ZDelos-Santos, EAyral-Kaloustian, SBrooijmans, NYu, KHollander, IFeldberg, LLucas, JMallon, R Identification of 2-oxatriazines as highly potent pan-PI3K/mTOR dual inhibitors. Bioorg Med Chem Lett21:4773-8 (2011) 
 
Serine/threonine-protein kinase mTOR
Name:Serine/threonine-protein kinase mTOR
Type:Rapamycin target protein
Mol. Mass.:288917.12
Organism:Homo sapiens (Human)
Description:P42345
Residue:2549
BDBM50349619
NameBDBM50349619
Synonyms:CHEMBL1808977
TypeSmall organic molecule
Emp. Form.C30H38N8O5
Mol. Mass.590.6733
SMILESCN(C)CCN(C)C(=O)c1ccc(NC(=O)Nc2ccc(cc2)-c2nc(O[C@H]3CCOC3)nc(n2)N2CCOCC2)cc1