Reaction Details
TargetProprotein convertase subtilisin/kexin type 7
LigandBDBM35525
Substrate/Competitorn/a
Meas. Tech.ChEMBL_760496 (CHEMBL1815481)
IC50 1300±n/a nM
Citation de Oliveira, CMSilva, GHRegasini, LOFlausino, OLópez, SNAbissi, BMBerlinck, RGSette, LDBonugli-Santos, RCRodrigues, ABolzani, Vda SAraujo, AR Xylarenones C-E from an endophytic fungus isolated from Alibertia macrophylla. J Nat Prod74:1353-7 (2011) 
 
Proprotein convertase subtilisin/kexin type 7
Name:Proprotein convertase subtilisin/kexin type 7
Type:PROTEIN
Mol. Mass.:86233.43
Organism:Homo sapiens (Human)
Description:ChEMBL_1290739
Residue:785
BDBM35525
NameBDBM35525
Synonyms:3,3''''-methylenebis(4-hydroxy-coumarin 3,3''''-methylenebis[4-hydroxycoumarin Bishydroxycoumarin DICUMAROL symmetric dicoumarol analogue, 1
TypeSmall organic molecule
Emp. Form.C19H12O6
Mol. Mass.336.295
SMILESOc1c(Cc2c(O)c3ccccc3oc2=O)c(=O)oc2ccccc12