Reaction Details
TargetD(4) dopamine receptor
LigandBDBM50349866
Substrate/Competitorn/a
Meas. Tech.ChEMBL_760691 (CHEMBL1815676)
Ki 212±n/a nM
Citation Vangveravong, SZhang, ZTaylor, MBearden, MXu, JCui, JWang, WLuedtke, RRMach, RH Synthesis and characterization of selective dopamine D2 receptor ligands using aripiprazole as the lead compound. Bioorg Med Chem19:3502-11 (2011) 
 
D(4) dopamine receptor
Name:D(4) dopamine receptor
Type:Enzyme
Mol. Mass.:48373.19
Organism:Homo sapiens (Human)
Description:P21917
Residue:419
BDBM50349866
NameBDBM50349866
Synonyms:CHEMBL160296 UNC10108016 | US9156822, 39
TypeSmall organic molecule
Emp. Form.C24H31N3O3
Mol. Mass.409.5212
SMILESCOc1ccccc1N1CCN(CCCCOc2ccc3CCC(=O)Nc3c2)CC1