Reaction Details
Target5-hydroxytryptamine receptor 1A
LigandBDBM50349940
Substrate/Competitorn/a
Meas. Tech.ChEMBL_761423 (CHEMBL1817053)
Ki 47±n/a nM
Citation Lewgowd, WBojarski, AJSzczesio, MOlczak, AGlowka, MLMordalski, SStanczak, A Synthesis and structural investigation of some pyrimido[5,4-c]quinolin-4(3H)-one derivatives with a long-chain arylpiperazine moiety as potent 5-HT(1A/2A) and 5-HT(7) receptor ligands. Eur J Med Chem46:3348-61 (2011) 
 
5-hydroxytryptamine receptor 1A
Name:5-hydroxytryptamine receptor 1A
Type:G Protein-Coupled Receptor (GPCR)
Mol. Mass.:46445.29
Organism:Rattus norvegicus (rat)
Description:Binding assays were performed using rat hippocampal membranes.
Residue:422
BDBM50349940
NameBDBM50349940
Synonyms:CHEMBL1812273
TypeSmall organic molecule
Emp. Form.C24H25N5O
Mol. Mass.399.4882
SMILESO=c1n(CCCN2CCN(CC2)c2ccccc2)cnc2c3ccccc3ncc12