Reaction Details
Target5-hydroxytryptamine receptor 1A
LigandBDBM50349962
Substrate/Competitorn/a
Meas. Tech.ChEMBL_761423 (CHEMBL1817053)
Ki 20±n/a nM
Citation Lewgowd, WBojarski, AJSzczesio, MOlczak, AGlowka, MLMordalski, SStanczak, A Synthesis and structural investigation of some pyrimido[5,4-c]quinolin-4(3H)-one derivatives with a long-chain arylpiperazine moiety as potent 5-HT(1A/2A) and 5-HT(7) receptor ligands. Eur J Med Chem46:3348-61 (2011) 
 
5-hydroxytryptamine receptor 1A
Name:5-hydroxytryptamine receptor 1A
Type:G Protein-Coupled Receptor (GPCR)
Mol. Mass.:46445.29
Organism:Rattus norvegicus (rat)
Description:Binding assays were performed using rat hippocampal membranes.
Residue:422
BDBM50349962
NameBDBM50349962
Synonyms:CHEMBL1812300
TypeSmall organic molecule
Emp. Form.C27H31N5O2
Mol. Mass.457.5673
SMILESCOc1ccccc1N1CCN(CCCCn2cnc3c4ccc(C)cc4ncc3c2=O)CC1