Reaction Details
TargetHepatocyte growth factor receptor
LigandBDBM50350084
Substrate/Competitorn/a
Meas. Tech.ChEMBL_762122 (CHEMBL1816161)
IC50>10000±n/a nM
Citation Zhao, AGao, XWang, YAi, JWang, YChen, YGeng, MZhang, A Discovery of novel c-Met kinase inhibitors bearing a thieno[2,3-d]pyrimidine or furo[2,3-d]pyrimidine scaffold. Bioorg Med Chem19:3906-18 (2011) 
 
Hepatocyte growth factor receptor
Name:Hepatocyte growth factor receptor
Type:Protein
Mol. Mass.:155559.73
Organism:Homo sapiens (Human)
Description:P08581
Residue:1390
BDBM50350084
NameBDBM50350084
Synonyms:CHEMBL1813651
TypeSmall organic molecule
Emp. Form.C31H20F2N4O6S
Mol. Mass.614.576
SMILESCS(=O)(=O)c1nc(Oc2ccc(NC(=O)c3cccn(-c4ccc(F)cc4)c3=O)cc2F)c2c(coc2n1)-c1ccccc1