Reaction Details
TargetProto-oncogene tyrosine-protein kinase Src
LigandBDBM50350069
Substrate/Competitorn/a
Meas. Tech.ChEMBL_762210 (CHEMBL1816281)
IC50>10000±n/a nM
Citation Zhao, AGao, XWang, YAi, JWang, YChen, YGeng, MZhang, A Discovery of novel c-Met kinase inhibitors bearing a thieno[2,3-d]pyrimidine or furo[2,3-d]pyrimidine scaffold. Bioorg Med Chem19:3906-18 (2011) 
 
Proto-oncogene tyrosine-protein kinase Src
Name:Proto-oncogene tyrosine-protein kinase Src
Type:Protein
Mol. Mass.:59838.60
Organism:Homo sapiens (Human)
Description:P12931
Residue:536
BDBM50350069
NameBDBM50350069
Synonyms:CHEMBL1813632
TypeSmall organic molecule
Emp. Form.C30H18F2N4O3S
Mol. Mass.552.551
SMILESFc1ccc(cc1)-n1cccc(C(=O)Nc2ccc(Oc3ncnc4scc(-c5ccccc5)c34)c(F)c2)c1=O