Reaction Details
TargetHepatocyte growth factor receptor
LigandBDBM50350088
Substrate/Competitorn/a
Meas. Tech.ChEMBL_762122 (CHEMBL1816161)
IC50>10000±n/a nM
Citation Zhao, AGao, XWang, YAi, JWang, YChen, YGeng, MZhang, A Discovery of novel c-Met kinase inhibitors bearing a thieno[2,3-d]pyrimidine or furo[2,3-d]pyrimidine scaffold. Bioorg Med Chem19:3906-18 (2011) 
 
Hepatocyte growth factor receptor
Name:Hepatocyte growth factor receptor
Type:Protein
Mol. Mass.:155559.73
Organism:Homo sapiens (Human)
Description:P08581
Residue:1390
BDBM50350088
NameBDBM50350088
Synonyms:CHEMBL1813644
TypeSmall organic molecule
Emp. Form.C29H22F2N4O3S
Mol. Mass.544.572
SMILESFc1ccc(cc1)-n1cccc(C(=O)Nc2ccc(Oc3ncnc4sc5CCCCCc5c34)c(F)c2)c1=O