Reaction Details
TargetDelta-type opioid receptor
LigandBDBM50350090
Substrate/Competitorn/a
Meas. Tech.ChEMBL_760920 (CHEMBL1814858)
IC50 5400±n/a nM
Citation Gao, JLeón, FRadwan, MMDale, ORHusni, ASManly, SPLupien, SWang, XHill, RADugan, FMCutler, HGCutler, SJ Benzyl derivatives with in vitro binding affinity for human opioid and cannabinoid receptors from the fungus Eurotium repens. J Nat Prod74:1636-9 (2011) 
 
Delta-type opioid receptor
Name:Delta-type opioid receptor
Type:G Protein-Coupled Receptor (GPCR)
Mol. Mass.:40382.98
Organism:Homo sapiens (Human)
Description:Competition binding assays were carried out using membrane preparations from transfected HN9.10 cells that constitutively expressed the delta opioid receptor.
Residue:372
BDBM50350090
NameBDBM50350090
Synonyms:CHEMBL1813662
TypeSmall organic molecule
Emp. Form.C19H28O3
Mol. Mass.304.4238
SMILES[#6]-[#6]-[#6]-[#6]-[#6]\[#6]=[#6]\c1c(-[#8])cc(-[#6]\[#6]=[#6](\[#6])-[#6])c(-[#8])c1-[#6]-[#8]