Reaction Details
TargetCannabinoid receptor 2
LigandBDBM50350089
Substrate/Competitorn/a
Meas. Tech.ChEMBL_760919 (CHEMBL1814857)
IC50 19900±n/a nM
Citation Gao, JLeón, FRadwan, MMDale, ORHusni, ASManly, SPLupien, SWang, XHill, RADugan, FMCutler, HGCutler, SJ Benzyl derivatives with in vitro binding affinity for human opioid and cannabinoid receptors from the fungus Eurotium repens. J Nat Prod74:1636-9 (2011) 
 
Cannabinoid receptor 2
Name:Cannabinoid receptor 2
Type:G Protein-Coupled Receptor (GPCR)
Mol. Mass.:39690.94
Organism:Homo sapiens (Human)
Description:P34972
Residue:360
BDBM50350089
NameBDBM50350089
Synonyms:CHEMBL1813666
TypeSmall organic molecule
Emp. Form.C19H22O3
Mol. Mass.298.3762
SMILES[#6]\[#6]=[#6]\[#6]=[#6]\[#6]=[#6]\c1c(-[#8])cc(-[#6]\[#6]=[#6](\[#6])-[#6])c(-[#8])c1-[#6]=O