Reaction Details
TargetMu-type opioid receptor
LigandBDBM50350092
Substrate/Competitorn/a
Meas. Tech.ChEMBL_760922 (CHEMBL1814860)
IC50 7200±n/a nM
Citation Gao, JLeón, FRadwan, MMDale, ORHusni, ASManly, SPLupien, SWang, XHill, RADugan, FMCutler, HGCutler, SJ Benzyl derivatives with in vitro binding affinity for human opioid and cannabinoid receptors from the fungus Eurotium repens. J Nat Prod74:1636-9 (2011) 
 
Mu-type opioid receptor
Name:Mu-type opioid receptor
Type:G Protein-Coupled Receptor (GPCR)
Mol. Mass.:44789.51
Organism:Homo sapiens (Human)
Description:P35372
Residue:400
BDBM50350092
NameBDBM50350092
Synonyms:CHEMBL1811938
TypeSmall organic molecule
Emp. Form.C19H26O3
Mol. Mass.302.4079
SMILES[#6]-[#6]-[#6]-[#6]-[#6]\[#6]=[#6]\c1c(-[#8])cc(-[#6]\[#6]=[#6](\[#6])-[#6])c(-[#8])c1-[#6]=O