Reaction Details
TargetPoly(ADP-ribose) glycohydrolase
LigandBDBM50350102
Substrate/Competitorn/a
Meas. Tech.ChEMBL_760969 (CHEMBL1814966)
IC50 21000±n/a nM
Citation Steffen, JDCoyle, DLDamodaran, KBeroza, PJacobson, MK Discovery and structure-activity relationships of modified salicylanilides as cell permeable inhibitors of poly(ADP-ribose) glycohydrolase (PARG). J Med Chem54:5403-13 (2011) 
 
Poly(ADP-ribose) glycohydrolase
Name:Poly(ADP-ribose) glycohydrolase
Type:Protein
Mol. Mass.:111107.13
Organism:Homo sapiens (Human)
Description:Q86W56
Residue:976
BDBM50350102
NameBDBM50350102
Synonyms:CHEMBL1813893
TypeSmall organic molecule
Emp. Form.C24H14Cl2F3NO3
Mol. Mass.492.274
SMILESOc1c(Cl)cc(Cl)cc1C(=O)Nc1ccc(Oc2ccc3ccccc3c2)c(c1)C(F)(F)F