Reaction Details
TargetAmine oxidase [flavin-containing] B
LigandBDBM50350111
Substrate/Competitorn/a
Meas. Tech.ChEMBL_760981 (CHEMBL1815009)
IC50 64±n/a nM
Citation Gaspar, ASilva, TYáñez, MVina, DOrallo, FOrtuso, FUriarte, EAlcaro, SBorges, F Chromone, a privileged scaffold for the development of monoamine oxidase inhibitors. J Med Chem54:5165-73 (2011) 
 
Amine oxidase [flavin-containing] B
Name:Amine oxidase [flavin-containing] B
Type:Protein
Mol. Mass.:58768.76
Organism:Homo sapiens (Human)
Description:P27338
Residue:520
BDBM50350111
NameBDBM50350111
Synonyms:CHEMBL1814064
TypeSmall organic molecule
Emp. Form.C16H11NO4
Mol. Mass.281.2628
SMILESOc1ccc(NC(=O)c2coc3ccccc3c2=O)cc1