Reaction Details
TargetGamma-aminobutyric acid receptor subunit alpha-1/beta-2
LigandBDBM81565
Substrate/Competitorn/a
Meas. Tech.ChEMBL_761260 (CHEMBL1816618)
EC50 14800±n/a nM
Citation Taferner, BSchuehly, WHuefner, ABaburin, IWiesner, KEcker, GFHering, S Modulation of GABAA-receptors by honokiol and derivatives: subtype selectivity and structure-activity relationship. J Med Chem54:5349-61 (2011) 
 
Gamma-aminobutyric acid receptor subunit alpha-1/beta-2
Name:Gamma-aminobutyric acid receptor subunit alpha-1/beta-2
Synonyms:GABA-A receptor; GABA-A site (alpha1/beta2 interface)
Type:n/a
Mol. Mass.:n/a
Description:ASSAY_ID of EBI is 761260
Components:This complex has 2 components.
Component 1
Name:Gamma-aminobutyric acid receptor subunit beta-2
Type:PROTEIN
Mol. Mass.:59167.91
Organism:Homo sapiens (Human)
Description:EBI_221
Residue:512
Component 2
Name:Gamma-aminobutyric acid receptor subunit alpha-1
Synonyms:Benzodiazepine central GABA A Benzodiazepine liver GABA(A) receptor subunit alpha-1 GABA-A receptor GBRA1_HUMAN TBPS | agonist GABA site
Type:Protein
Mol. Mass.:51817.35
Organism:Homo sapiens (Human)
Description:P14867
Residue:456
BDBM81565
NameBDBM81565
Synonyms:Magreth-17a
TypeSmall organic molecule
Emp. Form.C21H24O2
Mol. Mass.308.4141
SMILESCCCOc1ccc(CC=C)cc1-c1ccc(O)c(CC=C)c1