Reaction Details
TargetCannabinoid receptor 1
LigandBDBM50350161
Substrate/Competitorn/a
Meas. Tech.ChEMBL_761450 (CHEMBL1817171)
Ki 31.3±n/a nM
Citation Pasquini, SDe Rosa, MPedani, VMugnaini, CGuida, FLuongo, LDe Chiaro, MMaione, SDragoni, SFrosini, MLigresti, ADi Marzo, VCorelli, F Investigations on the 4-quinolone-3-carboxylic acid motif. 4. Identification of new potent and selective ligands for the cannabinoid type 2 receptor with diverse substitution patterns and antihyperalgesic effects in mice. J Med Chem54:5444-53 (2011) 
 
Cannabinoid receptor 1
Name:Cannabinoid receptor 1
Type:G Protein-Coupled Receptor (GPCR)
Mol. Mass.:52868.96
Organism:Homo sapiens (Human)
Description:P21554
Residue:472
BDBM50350161
NameBDBM50350161
Synonyms:CHEMBL1814468
TypeSmall organic molecule
Emp. Form.C25H32N2O2
Mol. Mass.392.5338
SMILESCCCCCn1c2ccccc2cc(C(=O)NC23CC4CC(CC(C4)C2)C3)c1=O