Reaction Details
TargetCannabinoid receptor 2
LigandBDBM50350153
Substrate/Competitorn/a
Meas. Tech.ChEMBL_761451 (CHEMBL1817172)
Ki 22.9±n/a nM
Citation Pasquini, SDe Rosa, MPedani, VMugnaini, CGuida, FLuongo, LDe Chiaro, MMaione, SDragoni, SFrosini, MLigresti, ADi Marzo, VCorelli, F Investigations on the 4-quinolone-3-carboxylic acid motif. 4. Identification of new potent and selective ligands for the cannabinoid type 2 receptor with diverse substitution patterns and antihyperalgesic effects in mice. J Med Chem54:5444-53 (2011) 
 
Cannabinoid receptor 2
Name:Cannabinoid receptor 2
Type:G Protein-Coupled Receptor (GPCR)
Mol. Mass.:39690.94
Organism:Homo sapiens (Human)
Description:P34972
Residue:360
BDBM50350153
NameBDBM50350153
Synonyms:CHEMBL1814460
TypeSmall organic molecule
Emp. Form.C26H33BrN2O3
Mol. Mass.501.456
SMILESCCCCCn1cc(C(=O)NC23CC4CC(CC(C4)C2)C3)c(=O)c2cc(Br)cc(OC)c12