Reaction Details
TargetArginase-1
LigandBDBM50350309
Substrate/Competitorn/a
Meas. Tech.ChEMBL_762137 (CHEMBL1816208)
Kd 8.8E2±n/a nM
Citation Ilies, MDi Costanzo, LDowling, DPThorn, KJChristianson, DW Binding ofa,a-disubstituted amino acids to arginase suggests new avenues for inhibitor design. J Med Chem54:5432-43 (2011) 
 
Arginase-1
Name:Arginase-1
Type:PROTEIN
Mol. Mass.:34737.53
Organism:Homo sapiens (Human)
Description:ChEMBL_978893
Residue:322
BDBM50350309
NameBDBM50350309
Synonyms:CHEMBL1812662
TypeSmall organic molecule
Emp. Form.C7H16BNO4
Mol. Mass.189.017
SMILESCC([NH3+])(CCCCB(O)O)C([O-])=O