Reaction Details
TargetProstaglandin D2 receptor
LigandBDBM50350359
Substrate/Competitorn/a
Meas. Tech.ChEMBL_761111 (CHEMBL1815365)
Ki 22±n/a nM
Citation Iwahashi, MShimabukuro, AOnoda, TMatsunaga, YOkada, YMatsumoto, RNambu, FNakai, HToda, M Discovery of selective indole-based prostaglandin D2 receptor antagonist. Bioorg Med Chem19:4574-88 (2011) 
 
Prostaglandin D2 receptor
Name:Prostaglandin D2 receptor
Type:PROTEIN
Mol. Mass.:40018.63
Organism:Mus musculus
Description:ChEMBL_788408
Residue:357
BDBM50350359
NameBDBM50350359
Synonyms:CHEMBL1813282
TypeSmall organic molecule
Emp. Form.C28H25NO6
Mol. Mass.471.5012
SMILESCc1c(CC(O)=O)c2ccccc2n1C(=O)c1ccc(OC[C@@H]2COc3ccccc3O2)cc1C