Reaction Details
TargetProstaglandin D2 receptor
LigandBDBM50350361
Substrate/Competitorn/a
Meas. Tech.ChEMBL_761111 (CHEMBL1815365)
Ki 5.4±n/a nM
Citation Iwahashi, MShimabukuro, AOnoda, TMatsunaga, YOkada, YMatsumoto, RNambu, FNakai, HToda, M Discovery of selective indole-based prostaglandin D2 receptor antagonist. Bioorg Med Chem19:4574-88 (2011) 
 
Prostaglandin D2 receptor
Name:Prostaglandin D2 receptor
Type:PROTEIN
Mol. Mass.:40018.63
Organism:Mus musculus
Description:ChEMBL_788408
Residue:357
BDBM50350361
NameBDBM50350361
Synonyms:CHEMBL1813289
TypeSmall organic molecule
Emp. Form.C28H24FNO5
Mol. Mass.473.4923
SMILESCc1c(CC(O)=O)c2cc(F)ccc2n1C(=O)c1ccc(OC[C@@H]2COc3ccccc23)cc1C