Reaction Details
TargetProstaglandin D2 receptor
LigandBDBM50350362
Substrate/Competitorn/a
Meas. Tech.ChEMBL_761111 (CHEMBL1815365)
Ki 7.1±n/a nM
Citation Iwahashi, MShimabukuro, AOnoda, TMatsunaga, YOkada, YMatsumoto, RNambu, FNakai, HToda, M Discovery of selective indole-based prostaglandin D2 receptor antagonist. Bioorg Med Chem19:4574-88 (2011) 
 
Prostaglandin D2 receptor
Name:Prostaglandin D2 receptor
Type:PROTEIN
Mol. Mass.:40018.63
Organism:Mus musculus
Description:ChEMBL_788408
Residue:357
BDBM50350362
NameBDBM50350362
Synonyms:CHEMBL1813284
TypeSmall organic molecule
Emp. Form.C28H25NO5
Mol. Mass.455.5018
SMILESCc1c(CC(O)=O)c2ccccc2n1C(=O)c1ccc(OC[C@@H]2Cc3ccccc3O2)cc1C